Target
Cytochrome P450 2C8
Ligand
BDBM50531004
Substrate
Meas. Tech.
ChEMBL_1914333 (CHEMBL4416916)
IC50
>50000±n/a nM
Citation
 Adebesin, AMWesser, TVijaykumar, JKonkel, APaudyal, MPLossie, JZhu, CWestphal, CPuli, NFischer, RSchunck, WHFalck, JR Development of Robust 17( J Med Chem 62:10124-10143 (2019)  
Target
Name:
Cytochrome P450 2C8
Synonyms:
CP2C8_HUMAN CYPIIC8 P450 IIC2 P450 form 1 | S-mephenytoin 4-hydroxylase
Type:
Protein
Mol. Mass.:
55839.23
Organism:
Homo sapiens (Human)
Description:
P10632
Residue:
490
  
Inhibitor
Name:
BDBM50531004
Synonyms:
CHEMBL1802692
Type:
Small organic molecule
Emp. Form.:
C19H34N2O4
Mol. Mass.:
354.4843
SMILES:
CNC(=O)C(=O)NCCCC\C=C/CCCCCCCCCC(O)=O
: