Target
Cytochrome P450 2B6
Ligand
BDBM50531004
Substrate
Meas. Tech.
ChEMBL_1914332 (CHEMBL4416915)
IC50
>50000±n/a nM
Citation
 Adebesin, AMWesser, TVijaykumar, JKonkel, APaudyal, MPLossie, JZhu, CWestphal, CPuli, NFischer, RSchunck, WHFalck, JR Development of Robust 17( J Med Chem 62:10124-10143 (2019)  
Target
Name:
Cytochrome P450 2B6
Synonyms:
CP2B6_HUMAN Cytochrome P450 2B6 (CYP2B6)
Type:
Protein
Mol. Mass.:
56289.75
Organism:
Homo sapiens (Human)
Description:
P20813
Residue:
491
  
Inhibitor
Name:
BDBM50531004
Synonyms:
CHEMBL1802692
Type:
Small organic molecule
Emp. Form.:
C19H34N2O4
Mol. Mass.:
354.4843
SMILES:
CNC(=O)C(=O)NCCCC\C=C/CCCCCCCCCC(O)=O
: