Target
Cytochrome P450 2C19
Ligand
BDBM50531005
Substrate
Meas. Tech.
ChEMBL_1914335 (CHEMBL4416918)
IC50
46200±n/a nM
Citation
 Adebesin, AMWesser, TVijaykumar, JKonkel, APaudyal, MPLossie, JZhu, CWestphal, CPuli, NFischer, RSchunck, WHFalck, JR Development of Robust 17( J Med Chem 62:10124-10143 (2019)  
Target
Name:
Cytochrome P450 2C19
Synonyms:
(R)-limonene 6-monooxygenase (S)-limonene 7-monooxygenase CYP2C19 CYPIIC19 Cytochrome P450 2C19 [I331V] Cytochrome P450-254C Mephenytoin 4-hydroxylase P450-254C
Type:
Enzyme
Mol. Mass.:
55935.47
Organism:
Homo sapiens (Human)
Description:
P33261
Residue:
490
  
Inhibitor
Name:
BDBM50531005
Synonyms:
CHEMBL4473988
Type:
Small organic molecule
Emp. Form.:
C18H32N2O5
Mol. Mass.:
356.4571
SMILES:
CNC(=O)C(=O)NCCCC\C=C/CCCCCCCOCC(O)=O
: