Target
Cytochrome P450 2C19
Ligand
BDBM50531003
Substrate
Meas. Tech.
ChEMBL_1914335 (CHEMBL4416918)
IC50
210±n/a nM
Citation
 Adebesin, AMWesser, TVijaykumar, JKonkel, APaudyal, MPLossie, JZhu, CWestphal, CPuli, NFischer, RSchunck, WHFalck, JR Development of Robust 17( J Med Chem 62:10124-10143 (2019)  
Target
Name:
Cytochrome P450 2C19
Synonyms:
(R)-limonene 6-monooxygenase (S)-limonene 7-monooxygenase CYP2C19 CYPIIC19 Cytochrome P450 2C19 [I331V] Cytochrome P450-254C Mephenytoin 4-hydroxylase P450-254C
Type:
Enzyme
Mol. Mass.:
55935.47
Organism:
Homo sapiens (Human)
Description:
P33261
Residue:
490
  
Inhibitor
Name:
BDBM50531003
Synonyms:
CHEMBL4463477
Type:
Small organic molecule
Emp. Form.:
C19H34N6O2
Mol. Mass.:
378.5123
SMILES:
CNC(=O)C(=O)NCCCC\C=C/CCCCCCCCCc1nnn[nH]1
: