Target
AMP deaminase 1
Ligand
BDBM50087301
Substrate
Meas. Tech.
ChEMBL_31893 (CHEMBL640310)
Ki
85000±n/a nM
Citation
 Bookser, BCKasibhatla, SRAppleman, JRErion, MD AMP deaminase inhibitors. 2. Initial discovery of a non-nucleotide transition-state inhibitor series. J Med Chem 43:1495-507 (2000)  
Target
Name:
AMP deaminase 1
Synonyms:
AMP deaminase 1 (hAMPD1) AMPD1 Myoadenylate deaminase
Type:
Protein
Mol. Mass.:
90225.27
Organism:
Homo sapiens (Human)
Description:
Residue:
780
  
Inhibitor
Name:
BDBM50087301
Synonyms:
CHEMBL290418 | Sodium; 4-(8-hydroxy-7,8-dihydro-6H-imidazo[4,5-d][1,3]diazepin-3-ylmethoxy)-butyrate H2O
Type:
Small organic molecule
Emp. Form.:
C11H15N4O4
Mol. Mass.:
267.2617
SMILES:
OC1CNC=Nc2c1ncn2COCCCC([O-])=O
: