Target
Prothrombin
Ligand
BDBM50087533
Substrate
Meas. Tech.
ChEBML_209232
Ki
2000±n/a nM
Citation
 Pruitt, JRPinto, DJEstrella, MJBostrom, LLKnabb, RMWong, PCWright, MRWexler, RR Isoxazolines and isoxazoles as factor Xa inhibitors. Bioorg Med Chem Lett 10:685-9 (2000)  
Target
Name:
Prothrombin
Synonyms:
Activation peptide fragment 1 Coagulation factor II Prothrombin precursor Thrombin heavy chain | Thrombin light chain
Type:
Protein
Mol. Mass.:
70029.57
Organism:
Homo sapiens (Human)
Description:
P00734
Residue:
622
  
Inhibitor
Name:
BDBM50087533
Synonyms:
3-(3-Carbamimidoyl-phenyl)-isoxazole-4-carboxylic acid (2'-sulfamoyl-biphenyl-4-yl)-amide CHEMBL153611
Type:
Small organic molecule
Emp. Form.:
C23H19N5O4S
Mol. Mass.:
461.493
SMILES:
NC(=N)c1cccc(c1)-c1nocc1C(=O)Nc1ccc(cc1)-c1ccccc1S(N)(=O)=O
: