Target
Dihydroorotate dehydrogenase (quinone), mitochondrial
Ligand
BDBM50532169
Substrate
Meas. Tech.
ChEMBL_1921932 (CHEMBL4424777)
IC50
15480±n/a nM
Citation
 Vyas, VKQureshi, GOza, DPatel, HParmar, KPatel, PGhate, MD Synthesis of 2-,4,-6-, and/or 7-substituted quinoline derivatives as human dihydroorotate dehydrogenase (hDHODH) inhibitors and anticancer agents: 3D QSAR-assisted design. Bioorg Med Chem Lett 29:917-922 (2019)  
Target
Name:
Dihydroorotate dehydrogenase (quinone), mitochondrial
Synonyms:
DHODH Dihydroorotate dehydrogenase Dihydroorotate dehydrogenase, mitochondrial Dihydroorotate oxidase (DHODH) | PYRD_HUMAN
Type:
Enzyme
Mol. Mass.:
42881.33
Organism:
Homo sapiens (Human)
Description:
Q02127
Residue:
395
  
Inhibitor
Name:
BDBM50532169
Synonyms:
CHEMBL4460949
Type:
Small organic molecule
Emp. Form.:
C24H19Cl2NO2
Mol. Mass.:
424.319
SMILES:
COc1ccc(cc1)-c1cc(COCc2ccccc2)c2cc(Cl)c(Cl)cc2n1
: