Target
Dihydroorotate dehydrogenase (quinone), mitochondrial
Ligand
BDBM50532172
Substrate
Meas. Tech.
ChEMBL_1921932 (CHEMBL4424777)
IC50
13440±n/a nM
Citation
 Vyas, VKQureshi, GOza, DPatel, HParmar, KPatel, PGhate, MD Synthesis of 2-,4,-6-, and/or 7-substituted quinoline derivatives as human dihydroorotate dehydrogenase (hDHODH) inhibitors and anticancer agents: 3D QSAR-assisted design. Bioorg Med Chem Lett 29:917-922 (2019)  
Target
Name:
Dihydroorotate dehydrogenase (quinone), mitochondrial
Synonyms:
DHODH Dihydroorotate dehydrogenase Dihydroorotate dehydrogenase, mitochondrial Dihydroorotate oxidase (DHODH) | PYRD_HUMAN
Type:
Enzyme
Mol. Mass.:
42881.33
Organism:
Homo sapiens (Human)
Description:
Q02127
Residue:
395
  
Inhibitor
Name:
BDBM50532172
Synonyms:
CHEMBL4544880
Type:
Small organic molecule
Emp. Form.:
C24H20FNO
Mol. Mass.:
357.4201
SMILES:
Cc1ccc2nc(cc(COCc3ccccc3)c2c1)-c1ccc(F)cc1
: