Target
cAMP-specific 3',5'-cyclic phosphodiesterase 4D
Ligand
BDBM14794
Substrate
Meas. Tech.
ChEMBL_1922364 (CHEMBL4425320)
IC50
2000±n/a nM
Citation
 Jansen, CKooistra, AJKanev, GKLeurs, Rde Esch, IJde Graaf, C PDEStrIAn: A Phosphodiesterase Structure and Ligand Interaction Annotated Database As a Tool for Structure-Based Drug Design. J Med Chem 59:7029-65 (2016)  
Target
Name:
cAMP-specific 3',5'-cyclic phosphodiesterase 4D
Synonyms:
3',5'-cyclic phosphodiesterase PDE43 PDE4D_HUMAN | Phosphodiesterase 4D
Type:
Protein
Mol. Mass.:
91092.69
Organism:
Homo sapiens (Human)
Description:
Q08499
Residue:
809
  
Inhibitor
Name:
BDBM14794
Synonyms:
Pyrazole carboxylic ester 17 | ethyl 1-(4-methoxyphenyl)-3,5-dimethyl-1H-pyrazole-4-carboxylate
Type:
Small organic molecule
Emp. Form.:
C15H18N2O3
Mol. Mass.:
274.315
SMILES:
CCOC(=O)c1c(C)nn(c1C)-c1ccc(OC)cc1
: