Target
Insulin-degrading enzyme
Ligand
BDBM50525489
Substrate
Meas. Tech.
ChEMBL_1922387 (CHEMBL4425343)
IC50
50±n/a nM
Citation
 Franzini, RMRandolph, C Chemical Space of DNA-Encoded Libraries. J Med Chem 59:6629-44 (2016)  
Target
Name:
Insulin-degrading enzyme
Synonyms:
Abeta-degrading protease IDE Insulin degrading enzyme (hIDE) Insulin-degrading enzyme Insulysin | insulin-degrading enzyme isoform 1 precursor
Type:
Enzyme Catalytic Domain
Mol. Mass.:
117968.59
Organism:
Homo sapiens (Human)
Description:
P14735
Residue:
1019
  
Inhibitor
Name:
BDBM50525489
Synonyms:
CHEMBL4556893
Type:
Small organic molecule
Emp. Form.:
C41H55N7O7
Mol. Mass.:
757.9181
SMILES:
NCCCC[C@@H]1NC(=O)\C=C\C(=O)N[C@@H](CCCCNC(=O)[C@@H](Cc2ccc(cc2)C(=O)c2ccccc2)NC(=O)[C@H](CC2CCCCC2)NC1=O)C(N)=O
: