Target
Epithelial discoidin domain-containing receptor 1
Ligand
BDBM50528539
Substrate
Meas. Tech.
ChEMBL_1922872 (CHEMBL4425828)
Kd
4.7±n/a nM
Citation
 Wang, ZBian, HBartual, SGDu, WLuo, JZhao, HZhang, SMo, CZhou, YXu, YTu, ZRen, XLu, XBrekken, RAYao, LBullock, ANSu, JDing, K Structure-Based Design of Tetrahydroisoquinoline-7-carboxamides as Selective Discoidin Domain Receptor 1 (DDR1) Inhibitors. J Med Chem 59:5911-6 (2016)  
Target
Name:
Epithelial discoidin domain-containing receptor 1
Synonyms:
CAK DDR1_HUMAN Discoidin domain-containing receptor 1 (DDR1) EDDR1 Epithelial discoidin domain receptor 1 (DDR1) Epithelial discoidin domain-containing receptor 1 (DDR1) Mammary carcinoma kinase 10 NTRK4 Protein-tyrosine kinase RTK 6 TRKE | Tyrosine-protein kinase CAK
Type:
Tyrosine-protein kinase
Mol. Mass.:
101130.02
Organism:
Homo sapiens (Human)
Description:
Q08345
Residue:
913
  
Inhibitor
Name:
BDBM50528539
Synonyms:
CHEMBL4553037
Type:
Small organic molecule
Emp. Form.:
C26H23F3N6O
Mol. Mass.:
492.4956
SMILES:
C[C@H]1CN(Cc2cc(ccc12)C(=O)Nc1cc(cc(c1)C(F)(F)F)-n1cnc(C)c1)c1cncnc1
: