Target
Serine/threonine-protein kinase 10
Ligand
BDBM50532781
Substrate
Meas. Tech.
ChEMBL_1923951 (CHEMBL4426907)
Kd
10.0±n/a nM
Citation
 Tan, LZhang, ZGao, DLuo, JTu, ZCLi, ZPeng, LRen, XDing, K 4-Oxo-1,4-dihydroquinoline-3-carboxamide Derivatives as New Axl Kinase Inhibitors. J Med Chem 59:6807-25 (2016)  
Target
Name:
Serine/threonine-protein kinase 10
Synonyms:
LOK STK10_HUMAN Serine/threonine-protein kinase 10 (STK10)
Type:
Protein
Mol. Mass.:
112139.54
Organism:
Homo sapiens (Human)
Description:
O94804
Residue:
968
  
Inhibitor
Name:
BDBM50532781
Synonyms:
CHEMBL4571241
Type:
Small organic molecule
Emp. Form.:
C30H27FN4O5
Mol. Mass.:
542.5576
SMILES:
CCc1ccc2n(C)c(C)c(C(=O)Nc3ccc(Oc4ncnc5cc(OC)c(OC)cc45)c(F)c3)c(=O)c2c1
: