Target
Hexokinase-4
Ligand
BDBM50533163
Substrate
Meas. Tech.
ChEMBL_1924593 (CHEMBL4427549)
EC50
14±n/a nM
Citation
 Dransfield, PJPattaropong, VLai, SFu, ZKohn, TJDu, XCheng, AXiong, YKomorowski, RJin, LConn, MTien, EDeWolf, WEHinklin, RJAicher, TDKraser, CFBoyd, SAVoegtli, WCCondroski, KRVeniant-Ellison, MMedina, JCHouze, JCoward, P Novel Series of Potent Glucokinase Activators Leading to the Discovery of AM-2394. ACS Med Chem Lett 7:714-8 (2016)  
Target
Name:
Hexokinase-4
Synonyms:
GCK Glucokinase (GK) HK IV HXK4_HUMAN Hexokinase-D
Type:
Enzyme
Mol. Mass.:
52175.81
Organism:
Homo sapiens (Human)
Description:
P35557
Residue:
465
  
Inhibitor
Name:
BDBM50533163
Synonyms:
CHEMBL4528539
Type:
Small organic molecule
Emp. Form.:
C20H18F2N4O3
Mol. Mass.:
400.3787
SMILES:
CCOc1ccc(cn1)-c1cnc(NC(=O)NC)cc1Oc1c(F)cccc1F
: