Target
Aurora kinase B
Ligand
BDBM50533243
Substrate
Meas. Tech.
ChEMBL_1924835 (CHEMBL4427791)
IC50
8530±n/a nM
Citation
 Shin, SYAhn, SYoon, HJung, HJung, YKoh, DLee, YHLim, Y Colorectal anticancer activities of polymethoxylated 3-naphthyl-5-phenylpyrazoline-carbothioamides. Bioorg Med Chem Lett 26:4301-9 (2016)  
Target
Name:
Aurora kinase B
Synonyms:
AIK2 AIM1 ARK2 AURKB_HUMAN Aurora B-INCENP Aurora kinase B (AURKB) STK-1 STK12 Serine/threonine-protein kinase aurora B
Type:
Protein
Mol. Mass.:
39327.72
Organism:
Homo sapiens (Human)
Description:
Q96GD4
Residue:
344
  
Inhibitor
Name:
BDBM50533243
Synonyms:
CHEMBL4514298
Type:
Small organic molecule
Emp. Form.:
C28H25N3O3S
Mol. Mass.:
483.581
SMILES:
COc1ccc(cc1)C1CC(=NN1C(=S)Nc1cccc(OC)c1)c1ccc2ccccc2c1O
: