Target
Aurora kinase A
Ligand
BDBM50533243
Substrate
Meas. Tech.
ChEMBL_1924834 (CHEMBL4427790)
IC50
105030±n/a nM
Citation
 Shin, SYAhn, SYoon, HJung, HJung, YKoh, DLee, YHLim, Y Colorectal anticancer activities of polymethoxylated 3-naphthyl-5-phenylpyrazoline-carbothioamides. Bioorg Med Chem Lett 26:4301-9 (2016)  
Target
Name:
Aurora kinase A
Synonyms:
AIK ARK-1 AURA AURKA_HUMAN Aurora 2 Aurora kinase A (AURKA) Aurora kinase A (Aurora-2) Aurora/IPL1-related kinase 1 Breast tumor-amplified kinase IAK1 STK15 GN Serine/threonine kinase 15 Serine/threonine-protein kinase 6 Serine/threonine-protein kinase aurora-A aurora-2 | hARK1
Type:
Serine/threonine-protein kinase
Mol. Mass.:
45830.98
Organism:
Homo sapiens (Human)
Description:
O14965
Residue:
403
  
Inhibitor
Name:
BDBM50533243
Synonyms:
CHEMBL4514298
Type:
Small organic molecule
Emp. Form.:
C28H25N3O3S
Mol. Mass.:
483.581
SMILES:
COc1ccc(cc1)C1CC(=NN1C(=S)Nc1cccc(OC)c1)c1ccc2ccccc2c1O
: