Target
Cell division protein FtsZ
Ligand
BDBM50203126
Substrate
Meas. Tech.
ChEMBL_1925104 (CHEMBL4428176)
Kd
23±n/a nM
Citation
 Hurley, KASantos, TMNepomuceno, GMHuynh, VShaw, JTWeibel, DB Targeting the Bacterial Division Protein FtsZ. J Med Chem 59:6975-98 (2016)  
Target
Name:
Cell division protein FtsZ
Synonyms:
FTSZ_ECOLI sfiB | sulB
Type:
Protein
Mol. Mass.:
40305.83
Organism:
Escherichia coli
Description:
P0A9A6
Residue:
383
  
Inhibitor
Name:
BDBM50203126
Synonyms:
3,4-dimethoxy-6,7-dihydro-[1,3]dioxolo[4,5-g]pyrido[2,1-a]isoquinolin-5-ylium 9,10-Dimethoxy-5,6-dihydro-[1,3]dioxolo[4,5-g]isoquino[3,2-a]isoquinolin-7-ylium chloride BERBERINE CHEMBL12089 cid_12456
Type:
Small organic molecule
Emp. Form.:
C20H18NO4
Mol. Mass.:
336.3607
SMILES:
COc1ccc2cc3-c4cc5OCOc5cc4CC[n+]3cc2c1OC
: