Target
Galectin-4
Ligand
BDBM50533580
Substrate
Meas. Tech.
ChEMBL_1925942 (CHEMBL4429014)
Kd
210000±n/a nM
Citation
 Rajput, VKMacKinnon, AMandal, SCollins, PBlanchard, HLeffler, HSethi, TSchambye, HMukhopadhyay, BNilsson, UJ A Selective Galactose-Coumarin-Derived Galectin-3 Inhibitor Demonstrates Involvement of Galectin-3-glycan Interactions in a Pulmonary Fibrosis Model. J Med Chem 59:8141-7 (2016)  
Target
Name:
Galectin-4
Synonyms:
Antigen NY-CO-27 L-36 lactose-binding protein LEG4_HUMAN Lactose-binding lectin 4
Type:
PROTEIN
Mol. Mass.:
35952.28
Organism:
Homo sapiens (Human)
Description:
ChEMBL_716454
Residue:
323
  
Inhibitor
Name:
BDBM50533580
Synonyms:
CHEMBL4446622
Type:
Small organic molecule
Emp. Form.:
C32H34O14S
Mol. Mass.:
674.669
SMILES:
[H][C@]1(O[C@H](CO)[C@H](O)[C@H](OCc2cc3ccccc3oc2=O)[C@H]1O)S[C@@H]1O[C@H](CO)[C@H](O)[C@H](OCc2cc3ccccc3oc2=O)[C@H]1O
: