Target
Sterol O-acyltransferase 1
Ligand
BDBM50089616
Substrate
Meas. Tech.
ChEBML_28943
IC50
>50000±n/a nM
Citation
 Obata, RSunazuka, TOtoguro, KTomoda, HHarigaya, YOmura, S Synthetic conversion of ACAT inhibitor to acetylcholinesterase inhibitor. Bioorg Med Chem Lett 10:1315-6 (2000)  
Target
Name:
Sterol O-acyltransferase 1
Synonyms:
ACACT ACAT Acetyl-CoA acetyltransferase, mitochondrial Acyl-CoA: cholesterol acyltransferase (ACAT) Cholesterol acyltransferase 1 SOAT1 STAT
Type:
Multi-pass membrane protein may form homo- or heterodimers.
Mol. Mass.:
64751.94
Organism:
Homo sapiens (Human)
Description:
P35610
Residue:
550
  
Inhibitor
Name:
BDBM50089616
Synonyms:
4a,12a-Dihydroxy-4,4,6a,12b-tetramethyl-9-(3,4,5-trimethoxy-phenyl)-4a,6,6a,12,12a,12b-hexahydro-4H,5H-7,10-dioxa-benzo[a]anthracene-1,11-dione territrem B
Type:
Small organic molecule
Emp. Form.:
C29H34O9
Mol. Mass.:
526.5749
SMILES:
COc1cc(cc(OC)c1OC)-c1cc2O[C@]3(C)CC[C@@]4(O)C(C)(C)C=CC(=O)[C@]4(C)[C@@]3(O)Cc2c(=O)o1
: