Target
Acetylcholinesterase
Ligand
BDBM50089618
Substrate
Meas. Tech.
ChEBML_28626
IC50
80000±n/a nM
Citation
 Obata, RSunazuka, TOtoguro, KTomoda, HHarigaya, YOmura, S Synthetic conversion of ACAT inhibitor to acetylcholinesterase inhibitor. Bioorg Med Chem Lett 10:1315-6 (2000)  
Target
Name:
Acetylcholinesterase
Synonyms:
ACES_HUMAN Acetylcholinesterase (AChE) | Acetylcholinesterase (human AChE)
Type:
Enzyme
Mol. Mass.:
67792.70
Organism:
Homo sapiens (Human)
Description:
P22303
Residue:
614
  
Inhibitor
Name:
BDBM50089618
Synonyms:
9-(6-Chloro-pyridin-3-yl)-3,6-dihydroxy-4-hydroxymethyl-4,6a,12b-trimethyl-1,2,3,4,4a,5,6,6a,12a,12b-decahydro-7,10-dioxa-benzo[a]anthracene-11,12-dione | CHEMBL25149
Type:
Small organic molecule
Emp. Form.:
C25H28ClNO7
Mol. Mass.:
489.945
SMILES:
CC1(CO)[C@@H](O)CC[C@@]2(C)C1C[C@H](O)[C@@]1(C)Oc3cc(oc(=O)c3C(=O)C21)-c1ccc(Cl)nc1
: