Target
Histone acetyltransferase p300
Ligand
BDBM50260093
Substrate
Meas. Tech.
ChEMBL_1929416 (CHEMBL4432592)
Ki
>10000±n/a nM
Citation
 Bradbury, RHCallis, RCarr, GRChen, HClark, EFeron, LGlossop, SGraham, MAHattersley, MJones, CLamont, SGOuvry, GPatel, APatel, JRabow, AARoberts, CAStokes, SStratton, NWalker, GEWard, LWhalley, DWhittaker, DWrigley, GWaring, MJ Optimization of a Series of Bivalent Triazolopyridazine Based Bromodomain and Extraterminal Inhibitors: The Discovery of (3R)-4-[2-[4-[1-(3-Methoxy-[1,2,4]triazolo[4,3-b]pyridazin-6-yl)-4-piperidyl]phenoxy]ethyl]-1,3-dimethyl-piperazin-2-one (AZD5153). J Med Chem 59:7801-17 (2016)  
Target
Name:
Histone acetyltransferase p300
Synonyms:
EP300 HIF1A/p300/CREB-binding protein P300
Type:
Protein
Mol. Mass.:
264223.04
Organism:
Homo sapiens (Human)
Description:
Q09472
Residue:
2414
  
Inhibitor
Name:
BDBM50260093
Synonyms:
CHEMBL4078100
Type:
Small organic molecule
Emp. Form.:
C25H33N7O3
Mol. Mass.:
479.5746
SMILES:
COc1nnc2ccc(nn12)N1CCC(CC1)c1ccc(OCCN2CCN(C)C(=O)[C@H]2C)cc1
: