Target
Heme oxygenase 1
Ligand
BDBM50183062
Substrate
Meas. Tech.
ChEMBL_1930139 (CHEMBL4433390)
IC50
2800±n/a nM
Citation
 Salerno, LFloresta, GCiaffaglione, VGentile, DMargani, FTurnaturi, RRescifina, APittalą, V Progress in the development of selective heme oxygenase-1 inhibitors and their potential therapeutic application. Eur J Med Chem 167:439-453 (2019)  
Target
Name:
Heme oxygenase 1
Synonyms:
HMOX1_RAT Heme Oxygenase 1 (HO-1) Hmox1
Type:
Enzyme
Mol. Mass.:
33005.15
Organism:
Rattus norvegicus (rat)
Description:
HO-1 obtained from rat spleen was used in enzyme assays.
Residue:
289
  
Inhibitor
Name:
BDBM50183062
Synonyms:
1-((2-(2-(4-chlorophenyl)ethyl)-1,3-dioxolan-2-yl)methyl)-1H-imidazole hydrochloride 2-[2-(4-chlorophenyl)ethyl]-2-[(1H-imidazol-1-yl)methyl]-1,3-dioxolane hydrochloride CHEMBL541899
Type:
Small organic molecule
Emp. Form.:
C15H17ClN2O2
Mol. Mass.:
292.761
SMILES:
Clc1ccc(CCC2(Cn3ccnc3)OCCO2)cc1
: