Target
P2X purinoceptor 1
Ligand
BDBM50535409
Substrate
Meas. Tech.
ChEMBL_1930451 (CHEMBL4433702)
IC50
>100000±n/a nM
Citation
 Dal Ben, DBuccioni, MLambertucci, CMarucci, GSpinaci, AMarchenkova, AAbdelrahman, ANistri, AMüller, CEVolpini, R Investigation on 2',3'- ACS Med Chem Lett 10:493-498 (2019)  
Target
Name:
P2X purinoceptor 1
Synonyms:
ATP receptor P2RX1_HUMAN Purinergic receptor | Purinergic, P2X
Type:
Enzyme Catalytic Domain
Mol. Mass.:
44992.65
Organism:
Homo sapiens (Human)
Description:
Purinergic, P2X 0 HUMAN::P51575
Residue:
399
  
Inhibitor
Name:
BDBM50535409
Synonyms:
CHEMBL4456926
Type:
Small organic molecule
Emp. Form.:
C17H32N9O13P3
Mol. Mass.:
663.4098
SMILES:
N.N.N.N.[H][C@]12O[C@@H](O[C@@]1([H])[C@@H](O[C@@H]2COP(O)(=O)OP(O)(=O)OP(O)(O)=O)n1cnc2c(N)ncnc12)c1ccccc1
: