Target
P2X purinoceptor 2
Ligand
BDBM50535412
Substrate
Meas. Tech.
ChEMBL_1930455 (CHEMBL4433706)
IC50
>10000±n/a nM
Citation
 Dal Ben, DBuccioni, MLambertucci, CMarucci, GSpinaci, AMarchenkova, AAbdelrahman, ANistri, AMüller, CEVolpini, R Investigation on 2',3'- ACS Med Chem Lett 10:493-498 (2019)  
Target
Name:
P2X purinoceptor 2
Synonyms:
ATP receptor P2RX2_HUMAN Purinergic receptor | PurinergicP2X2/3
Type:
Enzyme Catalytic Domain
Mol. Mass.:
51765.18
Organism:
Homo sapiens (Human)
Description:
PurinergicP2X2/3 0 HUMAN::Q9UBL9
Residue:
471
  
Inhibitor
Name:
BDBM50535412
Synonyms:
CHEMBL4570607
Type:
Small organic molecule
Emp. Form.:
C23H21N5O11
Mol. Mass.:
543.4397
SMILES:
[H][C@]12OC(C)(C)O[C@@]1([H])[C@@H](O[C@@H]2COC(=O)c1cc(C(O)=O)c(cc1C(O)=O)C(O)=O)n1cnc2c(N)ncnc12
: