Target
P2X purinoceptor 3
Ligand
BDBM50535415
Substrate
Meas. Tech.
ChEMBL_1930452 (CHEMBL4433703)
IC50
127±n/a nM
Citation
 Dal Ben, DBuccioni, MLambertucci, CMarucci, GSpinaci, AMarchenkova, AAbdelrahman, ANistri, AMüller, CEVolpini, R Investigation on 2',3'- ACS Med Chem Lett 10:493-498 (2019)  
Target
Name:
P2X purinoceptor 3
Synonyms:
ATP receptor P2X purinoceptor 3 P2rx3 | Purinergic receptor
Type:
PROTEIN
Mol. Mass.:
44443.68
Organism:
Mus musculus
Description:
ChEMBL_107625
Residue:
397
  
Inhibitor
Name:
BDBM50535415
Synonyms:
CHEMBL4463578
Type:
Small organic molecule
Emp. Form.:
C17H38N9O12P3
Mol. Mass.:
653.458
SMILES:
N.N.N.N.[H][C@]12OC3(CCCCC3)O[C@@]1([H])[C@@H](O[C@@H]2COP(O)(=O)CP(O)(=O)OP(O)(O)=O)n1cnc2c(N)ncnc12
: