Target
P2X purinoceptor 3
Ligand
BDBM50535409
Substrate
Meas. Tech.
ChEMBL_1930452 (CHEMBL4433703)
IC50
211±n/a nM
Citation
 Dal Ben, DBuccioni, MLambertucci, CMarucci, GSpinaci, AMarchenkova, AAbdelrahman, ANistri, AMüller, CEVolpini, R Investigation on 2',3'- ACS Med Chem Lett 10:493-498 (2019)  
Target
Name:
P2X purinoceptor 3
Synonyms:
ATP receptor P2X purinoceptor 3 P2rx3 | Purinergic receptor
Type:
PROTEIN
Mol. Mass.:
44443.68
Organism:
Mus musculus
Description:
ChEMBL_107625
Residue:
397
  
Inhibitor
Name:
BDBM50535409
Synonyms:
CHEMBL4456926
Type:
Small organic molecule
Emp. Form.:
C17H32N9O13P3
Mol. Mass.:
663.4098
SMILES:
N.N.N.N.[H][C@]12O[C@@H](O[C@@]1([H])[C@@H](O[C@@H]2COP(O)(=O)OP(O)(=O)OP(O)(O)=O)n1cnc2c(N)ncnc12)c1ccccc1
: