Target
P2X purinoceptor 2
Ligand
BDBM50535415
Substrate
Meas. Tech.
ChEMBL_1930455 (CHEMBL4433706)
IC50
>100000±n/a nM
Citation
 Dal Ben, DBuccioni, MLambertucci, CMarucci, GSpinaci, AMarchenkova, AAbdelrahman, ANistri, AMüller, CEVolpini, R Investigation on 2',3'- ACS Med Chem Lett 10:493-498 (2019)  
Target
Name:
P2X purinoceptor 2
Synonyms:
ATP receptor P2RX2_HUMAN Purinergic receptor | PurinergicP2X2/3
Type:
Enzyme Catalytic Domain
Mol. Mass.:
51765.18
Organism:
Homo sapiens (Human)
Description:
PurinergicP2X2/3 0 HUMAN::Q9UBL9
Residue:
471
  
Inhibitor
Name:
BDBM50535415
Synonyms:
CHEMBL4463578
Type:
Small organic molecule
Emp. Form.:
C17H38N9O12P3
Mol. Mass.:
653.458
SMILES:
N.N.N.N.[H][C@]12OC3(CCCCC3)O[C@@]1([H])[C@@H](O[C@@H]2COP(O)(=O)CP(O)(=O)OP(O)(O)=O)n1cnc2c(N)ncnc12
: