Target
Lysine-specific demethylase 6A
Ligand
BDBM50535443
Substrate
Meas. Tech.
ChEMBL_1930622 (CHEMBL4433873)
IC50
25700±n/a nM
Citation
 Giordano, AForte, GTerracciano, SRusso, ASala, MScala, MCJohansson, COppermann, URiccio, RBruno, IDi Micco, S Identification of the 2-Benzoxazol-2-yl-phenol Scaffold as New Hit for JMJD3 Inhibition. ACS Med Chem Lett 10:601-605 (2019)  
Target
Name:
Lysine-specific demethylase 6A
Synonyms:
Histone demethylase UTX KDM6A_HUMAN Lysine-specific demethylase 6A (KDM6A(UTX)) UTX Ubiquitously-transcribed X chromosome tetratricopeptide repeat protein
Type:
Protein
Mol. Mass.:
154198.48
Organism:
Homo sapiens (Human)
Description:
O15550
Residue:
1401
  
Inhibitor
Name:
BDBM50535443
Synonyms:
CHEMBL4591907
Type:
Small organic molecule
Emp. Form.:
C13H9NO3
Mol. Mass.:
227.2155
SMILES:
Oc1ccc(O)c(c1)-c1nc2ccccc2o1
: