Target
Tyrosine-protein phosphatase non-receptor type 1
Ligand
BDBM15819
Substrate
Meas. Tech.
ChEMBL_1931004 (CHEMBL4434255)
Ki
76±n/a nM
Citation
 Jin, JYe, XBoateng, DDai, KYe, FDu, PYu, H Identification and characterization of potent and selective inhibitors targeting protein tyrosine phosphatase 1B (PTP1B). Bioorg Med Chem Lett 29:2358-2363 (2019)  
Target
Name:
Tyrosine-protein phosphatase non-receptor type 1
Synonyms:
PTN1_HUMAN PTPN1 Protein tyrosine phosphatase-1B (PTP1B) Protein-tyrosine phosphatase 1B (PTP1B) Tyrosine-protein phosphatase non-receptor type 1 (PTP1B)
Type:
Protein phosphatase
Mol. Mass.:
49963.76
Organism:
Homo sapiens (Human)
Description:
Human recombinant GST-fusion PTP1B (1-435).
Residue:
435
  
Inhibitor
Name:
BDBM15819
Synonyms:
1:1 mixture of diastereomers CHEMBL55243 | oxalyl-aryl-amino benzoic acid-based inhibitor 19
Type:
Small organic molecule
Emp. Form.:
C32H40N4O10S
Mol. Mass.:
672.746
SMILES:
CCc1cc(CC(NC(C)=O)C(=O)NCCCCC(=O)N[C@@H](CCSC)C(O)=O)ccc1N(C(=O)C(O)=O)c1ccccc1C(O)=O
: