Target
3-oxo-5-alpha-steroid 4-dehydrogenase 1
Ligand
BDBM50057479
Substrate
Meas. Tech.
ChEBML_205056
Ki
26±n/a nM
Citation
 Abell, ADPrince, MJMcNulty, AMNeubauer, BL Simple bi- and tricyclic inhibitors of human steroid 5alpha-reductase. Bioorg Med Chem Lett 10:1909-11 (2001)  
Target
Name:
3-oxo-5-alpha-steroid 4-dehydrogenase 1
Synonyms:
3-oxo-5-alpha-steroid 4-dehydrogenase 1 S5A1_HUMAN SR type 1 Steroid 5-alpha-reductase | Steroid 5-alpha-reductase 1
Type:
Enzyme
Mol. Mass.:
29472.80
Organism:
Homo sapiens (Human)
Description:
P18405
Residue:
259
  
Inhibitor
Name:
BDBM50057479
Synonyms:
7-Bromo-9,10-dihydro-phenanthrene-2-carboxylic acid | CHEMBL25578
Type:
Small organic molecule
Emp. Form.:
C15H11BrO2
Mol. Mass.:
303.151
SMILES:
OC(=O)c1ccc-2c(CCc3cc(Br)ccc-23)c1
: