Target
Erythropoietin receptor
Ligand
BDBM50091857
Substrate
Meas. Tech.
ChEBML_67869
IC50
35000±n/a nM
Citation
 Connolly, PJWetter, SKMurray, WVJohnson, DLMcMahon, FJFarrell, FXTullai, JJolliffe, LK Synthesis and erythropoietin receptor binding affinities of N,N-disubstituted amino acids. Bioorg Med Chem Lett 10:1995-9 (2001)  
Target
Name:
Erythropoietin receptor
Synonyms:
EPO-R EPOR_HUMAN
Type:
PROTEIN
Mol. Mass.:
55040.56
Organism:
Homo sapiens (Human)
Description:
ChEMBL_67864
Residue:
508
  
Inhibitor
Name:
BDBM50091857
Synonyms:
(S)-2-{Bis-[(E)-3-(3-phenoxy-phenyl)-allyl]-amino}-6-methanesulfonylamino-hexanoic acid methyl ester | CHEMBL60623
Type:
Small organic molecule
Emp. Form.:
C38H42N2O6S
Mol. Mass.:
654.815
SMILES:
COC(=O)[C@H](CCCCNS(C)(=O)=O)N(C\C=C\c1cccc(Oc2ccccc2)c1)C\C=C\c1cccc(Oc2ccccc2)c1
: