Target
Sentrin-specific protease 1
Ligand
BDBM50437693
Substrate
Meas. Tech.
ChEMBL_1934021 (CHEMBL4479673)
Ki
930±n/a nM
Citation
 Yoshioka, YNamiki, DMakiuchi, MSugaya, KOnose, JAshida, HAbe, N Vialinin A and thelephantin G, potent inhibitors of tumor necrosis factor-? production, inhibit sentrin/SUMO-specific protease 1 enzymatic activity. Bioorg Med Chem Lett 26:4237-40 (2016)  
Target
Name:
Sentrin-specific protease 1
Synonyms:
SENP1 Sentrin-specific protease 1 (SENP1)
Type:
Protein
Mol. Mass.:
73500.42
Organism:
Homo sapiens (Human)
Description:
Q9P0U3
Residue:
644
  
Inhibitor
Name:
BDBM50437693
Synonyms:
VIALININ A
Type:
Small organic molecule
Emp. Form.:
C34H26O8
Mol. Mass.:
562.5654
SMILES:
Oc1ccc(cc1)-c1c(O)c(O)c(-c2ccc(O)cc2)c(OC(=O)Cc2ccccc2)c1OC(=O)Cc1ccccc1
: