Target
Aldehyde dehydrogenase, mitochondrial
Ligand
BDBM50093535
Substrate
Meas. Tech.
ChEMBL_28556 (CHEMBL641008)
IC50
3±n/a nM
Citation
 Rooke, NLi, DJLi, JKeung, WM The mitochondrial monoamine oxidase-aldehyde dehydrogenase pathway: a potential site of action of daidzin. J Med Chem 43:4169-79 (2000)  
Target
Name:
Aldehyde dehydrogenase, mitochondrial
Synonyms:
ALDH class 2 ALDH2 ALDHI Aldehyde dehydrogenase (ALDH2)
Type:
Enzyme
Mol. Mass.:
56382.67
Organism:
Homo sapiens (Human)
Description:
P05091
Residue:
517
  
Inhibitor
Name:
BDBM50093535
Synonyms:
11-(3-(4-hydroxyphenyl)-4-oxo-4H-chromen-7-yloxy)undecanoic acid CHEMBL113123
Type:
Small organic molecule
Emp. Form.:
C26H30O6
Mol. Mass.:
438.5128
SMILES:
OC(=O)CCCCCCCCCCOc1ccc2c(c1)occ(-c1ccc(O)cc1)c2=O
: