Target
Coagulation factor X
Ligand
BDBM50537828
Substrate
Meas. Tech.
ChEMBL_1971486 (CHEMBL4604304)
Kd
1.9±n/a nM
Citation
 Shi, YPan, BWLi, WCWang, QWu, QPan, MFu, HZ Synthesis and biological evaluation of Isosteviol derivatives as FXa inhibitors. Bioorg Med Chem Lett 30:0 (2020)  
Target
Name:
Coagulation factor X
Synonyms:
Activated coagulation factor X (FXa) Coagulation factor X precursor F10 Factor X heavy chain Factor Xa Stuart-Prower factor
Type:
Enzyme
Mol. Mass.:
54726.60
Organism:
Homo sapiens (Human)
Description:
Residue:
488
  
Inhibitor
Name:
BDBM50537828
Synonyms:
CHEMBL4635937
Type:
Small organic molecule
Emp. Form.:
C29H40ClN3O2S
Mol. Mass.:
530.165
SMILES:
[H][C@@]12CC[C@@]3(C)C[C@@]1(C\C3=N/NC(=S)Nc1ccccc1Cl)CC[C@]1([H])[C@@](C)(CCC[C@@]21C)C(=O)OCC
: