Target
Muscarinic acetylcholine receptor M2
Ligand
BDBM50538312
Substrate
Meas. Tech.
ChEMBL_1972542 (CHEMBL4605360)
Kd
0.891±n/a nM
Citation
 She, XPegoli, AGruber, CGWifling, DCarpenter, JHübner, HChen, MWan, JBernhardt, GGmeiner, PHolliday, NDKeller, M Red-Emitting Dibenzodiazepinone Derivatives as Fluorescent Dualsteric Probes for the Muscarinic Acetylcholine M J Med Chem 63:4133-4154 (2020)  
Target
Name:
Muscarinic acetylcholine receptor M2
Synonyms:
ACM2_HUMAN Cholinergic, muscarinic M2 Muscarinic acetylcholine receptor M2 and M5 | RecName: Full=Muscarinic acetylcholine receptor M2
Type:
GPCR
Mol. Mass.:
51730.61
Organism:
Homo sapiens (Human)
Description:
P08172
Residue:
466
  
Inhibitor
Name:
BDBM50538312
Synonyms:
CHEMBL4641726
Type:
Small organic molecule
Emp. Form.:
C69H86F6N8O13S2
Mol. Mass.:
1413.587
SMILES:
OC(=O)C(F)(F)F.OC(=O)C(F)(F)F.CC1(C)\C(=C/C=C/C=C/C2=[N+](CCCCS([O-])(=O)=O)c3ccccc3C2(C)C)N(CCCCCC(=O)NCCN2CCN(CCCCC3CCN(CC(=O)N4c5ccccc5NC(=O)c5ccccc45)CC3)CC2)c2ccc(cc12)S(O)(=O)=O
: