Target
Muscarinic acetylcholine receptor M2
Ligand
BDBM50095102
Substrate
Meas. Tech.
ChEBML_140175
Ki
0.823000±n/a nM
Citation
 Boyle, CDChackalamannil, SChen, LYDugar, SPushpavanam, PBillard, WBinch, HCrosby, GCohen-Williams, MCoffin, VLDuffy, RARuperto, VLachowicz, JE Benzylidene ketal derivatives as M2 muscarinic receptor antagonists. Bioorg Med Chem Lett 10:2727-30 (2000)  
Target
Name:
Muscarinic acetylcholine receptor M2
Synonyms:
ACM2_HUMAN Cholinergic, muscarinic M2 Muscarinic acetylcholine receptor M2 and M5 | RecName: Full=Muscarinic acetylcholine receptor M2
Type:
GPCR
Mol. Mass.:
51730.61
Organism:
Homo sapiens (Human)
Description:
P08172
Residue:
466
  
Inhibitor
Name:
BDBM50095102
Synonyms:
4-{2-[4-(Benzo[1,3]dioxole-5-sulfinyl)-phenyl]-[1,3]dioxolan-2-yl}-1'-(propane-1-sulfonyl)-[1,4']bipiperidinyl | CHEMBL93017
Type:
Small organic molecule
Emp. Form.:
C29H38N2O7S2
Mol. Mass.:
590.751
SMILES:
CCCS(=O)(=O)N1CCC(CC1)N1CCC(CC1)C1(OCCO1)c1ccc(cc1)S(=O)c1ccc2OCOc2c1
: