Target
L-lactate dehydrogenase A chain
Ligand
BDBM50539400
Substrate
Meas. Tech.
ChEMBL_1978001 (CHEMBL4611136)
Kd
2410±n/a nM
Citation
 Wang, FZhao, QLiu, JWang, ZKong, D Identification of human lactate dehydrogenase A inhibitors with anti-osteosarcoma activity through cell-based phenotypic screening. Bioorg Med Chem Lett 30:0 (2020)  
Target
Name:
L-lactate dehydrogenase A chain
Synonyms:
Cell proliferation-inducing gene 19 protein L-lactate dehydrogenase A Chain LDH-A LDHA Lactate dehydrogenase A (LDHA) | Renal carcinoma antigen NY-REN-59
Type:
Protein
Mol. Mass.:
36694.85
Organism:
Homo sapiens (Human)
Description:
P00338::PDB Code: 4ajp
Residue:
332
  
Inhibitor
Name:
BDBM50539400
Synonyms:
CHEMBL4648371
Type:
Small organic molecule
Emp. Form.:
C22H23N5O2
Mol. Mass.:
389.4503
SMILES:
CC(C)Cc1nc2cc(ccc2[nH]1)-n1c[n+]([O-])c(C(=O)Nc2ccccc2)c1C
: