Target
Hexokinase-4
Ligand
BDBM50441152
Substrate
Meas. Tech.
ChEMBL_1980961 (CHEMBL4614223)
EC50
5800±n/a nM
Citation
 Hinklin, RJBaer, BRBoyd, SAChicarelli, MDCondroski, KRDeWolf, WEFischer, JFrank, MHingorani, GPLee, PANeitzel, NAPratt, SASingh, ASullivan, FXTurner, TVoegtli, WCWallace, EMWilliams, LAicher, TD Discovery and preclinical development of AR453588 as an anti-diabetic glucokinase activator. Bioorg Med Chem 28:0 (2020)  
Target
Name:
Hexokinase-4
Synonyms:
GCK Glucokinase (GK) HK IV HXK4_HUMAN Hexokinase-D
Type:
Enzyme
Mol. Mass.:
52175.81
Organism:
Homo sapiens (Human)
Description:
P35557
Residue:
465
  
Inhibitor
Name:
BDBM50441152
Synonyms:
CHEMBL2430868
Type:
Small organic molecule
Emp. Form.:
C16H15N3OS
Mol. Mass.:
297.375
SMILES:
Cc1csc(Nc2ncccc2OCc2ccccc2)n1
: