Target
Carbonic anhydrase 2
Ligand
BDBM50540941
Substrate
Meas. Tech.
ChEMBL_1983277 (CHEMBL4616539)
Ki
0.700000±n/a nM
Citation
 Bonardi, ANocentini, ABua, SCombs, JLomelino, CAndring, JLucarini, LSgambellone, SMasini, EMcKenna, RGratteri, PSupuran, CT Sulfonamide Inhibitors of Human Carbonic Anhydrases Designed through a Three-Tails Approach: Improving Ligand/Isoform Matching and Selectivity of Action. J Med Chem 63:7422-7444 (2020)  
Target
Name:
Carbonic anhydrase 2
Synonyms:
CA-II CAC Carbonate dehydratase II Carbonic anhydrase 2 (CA-II) Carbonic anhydrase C Carbonic anhydrase II (CA-II) Carbonic anhydrase II (hCA II) | Carbonic anhydrase isoenzyme II (hCA II)
Type:
Enzyme
Mol. Mass.:
29250.71
Organism:
Homo sapiens (Human)
Description:
P00918
Residue:
260
  
Inhibitor
Name:
BDBM50540941
Synonyms:
CHEMBL4633228
Type:
Small organic molecule
Emp. Form.:
C23H27N5O3S
Mol. Mass.:
453.557
SMILES:
NS(=O)(=O)c1ccc(CCN(CC#N)C(=O)CN(CCC#N)CCc2ccccc2)cc1
: