Target
Tyrosine--tRNA ligase, cytoplasmic
Ligand
BDBM50097745
Substrate
Meas. Tech.
ChEBML_226002
IC50
260±n/a nM
Citation
 Brown, PEggleston, DSHaltiwanger, RCJarvest, RLMensah, LO'Hanlon, PJPope, AJ Synthetic analogues of SB-219383. Novel C-glycosyl peptides as inhibitors of tyrosyl tRNA synthetase. Bioorg Med Chem Lett 11:711-4 (2001)  
Target
Name:
Tyrosine--tRNA ligase, cytoplasmic
Synonyms:
SYYC_HUMAN YARS | YARS1
Type:
PROTEIN
Mol. Mass.:
59145.78
Organism:
Homo sapiens (Human)
Description:
ChEMBL_211030
Residue:
528
  
Inhibitor
Name:
BDBM50097745
Synonyms:
CHEMBL159436 | [2-Amino-3-((S)-4-hydroxy-phenyl)-propionylamino]-((2S,3R,4S,5S)-3,4,5-trihydroxy-tetrahydro-pyran-2-yl)-acetic acid
Type:
Small organic molecule
Emp. Form.:
C16H22N2O8
Mol. Mass.:
370.3545
SMILES:
N[C@@H](Cc1ccc(O)cc1)C(=O)N[C@H]([C@@H]1OC[C@H](O)[C@H](O)[C@H]1O)C(O)=O
: