Target
N-alpha-acetyltransferase 50
Ligand
BDBM50367033
Substrate
Meas. Tech.
ChEMBL_1985516 (CHEMBL4618922)
Kd
156±n/a nM
Target
Name:
N-alpha-acetyltransferase 50
Synonyms:
2.3.1.- MAK3 N-acetyltransferase 5 N-alpha-acetyltransferase 50 NAA50 NAT13 NatE catalytic subunit hNAT5 hSAN
Type:
PROTEIN
Mol. Mass.:
19405.69
Organism:
Homo sapiens
Description:
ChEMBL_119947
Residue:
169
  
Inhibitor
Name:
BDBM50367033
Synonyms:
COENZYME_A
Type:
Small organic molecule
Emp. Form.:
C21H36N7O16P3S
Mol. Mass.:
767.534
SMILES:
CC(C)(CO[P@@](O)(=O)O[P@](O)(=O)OC[C@H]1O[C@H]([C@H](O)[C@@H]1OP(O)(O)=O)n1cnc2c(N)ncnc12)[C@@H](O)C(=O)NCCC(=O)NCCS
: