Target
Neurogenic locus notch homolog protein 1
Ligand
BDBM50541988
Substrate
Meas. Tech.
ChEMBL_1985698 (CHEMBL4619104)
IC50
3.0±n/a nM
Citation
 Ratni, HAlker, ABartels, BBissantz, CChen, WGerlach, ILimberg, ALu, MNeidhart, WPichereau, SReutlinger, MRodriguez-Sarmiento, RMJakob-Roetne, RSchmitt, GZhang, EBaumann, K Discovery of RO7185876, a Highly Potent ?-Secretase Modulator (GSM) as a Potential Treatment for Alzheimer's Disease. ACS Med Chem Lett 11:1257-1268 (2020)  
Target
Name:
Neurogenic locus notch homolog protein 1
Synonyms:
NEXT NOTC1_HUMAN Neurogenic locus notch homolog protein 1 Notch 1 Notch 1 intracellular domain TAN1 hN1
Type:
Enzyme
Mol. Mass.:
272417.95
Organism:
Homo sapiens (Human)
Description:
P46531
Residue:
2555
  
Inhibitor
Name:
BDBM50541988
Synonyms:
CHEMBL4645821
Type:
Small organic molecule
Emp. Form.:
C23H26F2N8
Mol. Mass.:
452.5029
SMILES:
[H][C@]12CC[C@]([H])(CN(C1)c1cc(C)ncn1)[C@H]2Nc1nc2N(CCCn2n1)c1cc(F)cc(F)c1
: