Target
Histone acetyltransferase p300
Ligand
BDBM50542046
Substrate
Meas. Tech.
ChEMBL_1985843 (CHEMBL4619249)
IC50
2.5±n/a nM
Citation
 Wilson, JEPatel, GPatel, CBrucelle, FHuhn, AGardberg, ASPoy, FCantone, NBommi-Reddy, ASims, RJCummings, RTLevell, JR Discovery of CPI-1612: A Potent, Selective, and Orally Bioavailable EP300/CBP Histone Acetyltransferase Inhibitor. ACS Med Chem Lett 11:1324-1329 (2020)  
Target
Name:
Histone acetyltransferase p300
Synonyms:
EP300 HIF1A/p300/CREB-binding protein P300
Type:
Protein
Mol. Mass.:
264223.04
Organism:
Homo sapiens (Human)
Description:
Q09472
Residue:
2414
  
Inhibitor
Name:
BDBM50542046
Synonyms:
CHEMBL4633516 | US11414384, Example 84 Isomer 2
Type:
Small organic molecule
Emp. Form.:
C29H25N5O
Mol. Mass.:
459.5417
SMILES:
Cn1cc(cn1)-c1ccc2c(c[nH]c2c1)C(=O)[C@H](NCCc1ccc(cc1)C#N)c1ccccc1
: