Target
Retinal rod rhodopsin-sensitive cGMP 3',5'-cyclic phosphodiesterase subunit delta
Ligand
BDBM50019865
Substrate
Meas. Tech.
ChEMBL_1986049 (CHEMBL4619455)
Kd
<10.0±n/a nM
Citation
 Cheng, JLi, YWang, XDong, GSheng, C Discovery of Novel PDE? Degraders for the Treatment of KRAS Mutant Colorectal Cancer. J Med Chem 63:7892-7905 (2020)  
Target
Name:
Retinal rod rhodopsin-sensitive cGMP 3',5'-cyclic phosphodiesterase subunit delta
Synonyms:
3',5'-cyclic phosphodiesterase PDE6D PDED Retinal rod rhodopsin-sensitive cGMP 3',5'-cyclic phosphodiesterase subunit delta
Type:
PROTEIN
Mol. Mass.:
17418.30
Organism:
Homo sapiens (Human)
Description:
ChEMBL_105761
Residue:
150
  
Inhibitor
Name:
BDBM50019865
Synonyms:
CHEMBL3286929
Type:
Small organic molecule
Emp. Form.:
C40H37N5O
Mol. Mass.:
603.7547
SMILES:
C(Oc1ccc(cc1)-c1nc2ccccc2n1Cc1ccccc1)[C@H](C1CCNCC1)n1c(nc2ccccc12)-c1ccccc1
: