Target
Tyrosine-protein kinase JAK1
Ligand
BDBM419652
Substrate
Meas. Tech.
ChEMBL_1986887 (CHEMBL4620434)
IC50
11±n/a nM
Citation
 Fensome, AAmbler, CMArnold, EBanker, MEClark, JDDowty, MEEfremov, IVFlick, AGerstenberger, BSGifford, RSGopalsamy, AHegen, MJussif, JLimburg, DCLin, THPierce, BSSharma, RTrujillo, JIVajdos, FFVincent, FWan, ZKXing, LYang, XYang, X Design and optimization of a series of 4-(3-azabicyclo[3.1.0]hexan-3-yl)pyrimidin-2-amines: Dual inhibitors of TYK2 and JAK1. Bioorg Med Chem 28:0 (2020)  
Target
Name:
Tyrosine-protein kinase JAK1
Synonyms:
JAK-1 JAK1A JAK1_HUMAN Janus kinase 1 (JAK1) | Janus kinase 1 JAK1
Type:
Protein
Mol. Mass.:
133293.73
Organism:
Homo sapiens (Human)
Description:
P23458
Residue:
1154
  
Inhibitor
Name:
BDBM419652
Synonyms:
US10463675, Example 95 US11197867, Example 95
Type:
Small organic molecule
Emp. Form.:
C19H21FN8O
Mol. Mass.:
396.4214
SMILES:
C[C@@H]1[C@@H]2CN(C[C@]12NC(=O)[C@@H]1C[C@H]1C#N)c1nc(Nc2cnn(C)c2)ncc1F
: