Target
Son of sevenless homolog 1
Ligand
BDBM50542992
Substrate
Meas. Tech.
ChEMBL_1988242 (CHEMBL4621789)
Kd
24500±n/a nM
Citation
 Sarkar, DOlejniczak, ETPhan, JCoker, JASai, JArnold, ABeesetty, YWaterson, AGFesik, SW Discovery of Sulfonamide-Derived Agonists of SOS1-Mediated Nucleotide Exchange on RAS Using Fragment-Based Methods. J Med Chem 63:8325-8337 (2020)  
Target
Name:
Son of sevenless homolog 1
Synonyms:
SOS-1 SOS1_HUMAN
Type:
PROTEIN
Mol. Mass.:
152470.33
Organism:
Homo sapiens (Human)
Description:
ChEMBL_839705
Residue:
1333
  
Inhibitor
Name:
BDBM50542992
Synonyms:
CHEMBL4641887
Type:
Small organic molecule
Emp. Form.:
C12H10F2N2O2S
Mol. Mass.:
284.282
SMILES:
NS(=O)(=O)c1ccc(Nc2cc(F)cc(F)c2)cc1
: