Target
Sodium/glucose cotransporter 1
Ligand
BDBM50543520
Substrate
Meas. Tech.
ChEMBL_1989320 (CHEMBL4623055)
EC50
37±n/a nM
Citation
 Dowarah, JSingh, VP Anti-diabetic drugs recent approaches and advancements. Bioorg Med Chem 28:0 (2020)  
Target
Name:
Sodium/glucose cotransporter 1
Synonyms:
High affinity sodium-glucose cotransporter Na(+)/glucose cotransporter 1 SGLT1 Sodium-dependent glucose cotransporter 1 (SGLT1) Sodium/glucose cotransporter 1 (SGLT1) | Solute carrier family 5 member 1
Type:
Protein
Mol. Mass.:
73503.78
Organism:
Homo sapiens (Human)
Description:
P13866
Residue:
664
  
Inhibitor
Name:
BDBM50543520
Synonyms:
CHEMBL4642473
Type:
Small organic molecule
Emp. Form.:
C25H29ClN2O4
Mol. Mass.:
456.962
SMILES:
ONC[C@H]1C[C@H]([C@H](O)[C@@H](O)[C@@H]1O)n1cc(Cc2ccc(cc2)C2CC2)c2c(Cl)cccc12
: