Target
Cysteine proteinase B
Ligand
BDBM50543688
Substrate
Meas. Tech.
ChEMBL_1989726 (CHEMBL4623461)
IC50
54000±n/a nM
Citation
 Costa, CALopes, RMFerraz, LSEsteves, GNNDi Iorio, JFSouza, AAde Oliveira, IMManarin, FJudice, WASStefani, HARodrigues, T Cytotoxicity of 4-substituted quinoline derivatives: Anticancer and antileishmanial potential. Bioorg Med Chem 28:0 (2020)  
Target
Name:
Cysteine proteinase B
Synonyms:
LMCPB LMCPB_LEIME
Type:
PROTEIN
Mol. Mass.:
47725.09
Organism:
Leishmania mexicana
Description:
ChEMBL_303092
Residue:
443
  
Inhibitor
Name:
BDBM50543688
Synonyms:
CHEMBL4635812
Type:
Small organic molecule
Emp. Form.:
C18H15NO2Se
Mol. Mass.:
356.28
SMILES:
[#6]-[#6]-[#8]-[#6](=O)-c1cc([Se;v2]c2ccccc2)c2ccccc2n1
: