Target
72 kDa type IV collagenase
Ligand
BDBM50101509
Substrate
Meas. Tech.
ChEMBL_104539 (CHEMBL718926)
Ki
0.01±n/a nM
Citation
 Terp, GEJohansen, BNChristensen, ITJørgensen, FS A new concept for multidimensional selection of ligand conformations (MultiSelect) and multidimensional scoring (MultiScore) of protein-ligand binding affinities. J Med Chem 44:2333-43 (2001)  
Target
Name:
72 kDa type IV collagenase
Synonyms:
72 kDa gelatinase CLG4A Gelatinase A (MMP-2) MMP2_HUMAN Matrix metalloproteinase-2 (MMP 2) Matrix metalloproteinases 2 (MMP-2) | TBE-1
Type:
Enzyme
Mol. Mass.:
73870.36
Organism:
Homo sapiens (Human)
Description:
P08253
Residue:
660
  
Inhibitor
Name:
BDBM50101509
Synonyms:
CHEMBL306947 | N*1*-(2-Cyclohexyl-1-{2-[2-(morpholine-4-sulfonylamino)-ethylcarbamoyl]-ethylcarbamoyl}-ethyl)-N*4*-hydroxy-2-(3-p-tolyl-propyl)-succinamide
Type:
Small organic molecule
Emp. Form.:
C32H52N6O8S
Mol. Mass.:
680.856
SMILES:
Cc1ccc(CCC[C@H](CC(=O)NO)C(=O)N[C@@H](CC2CCCCC2)C(=O)NCCC(=O)NCCNS(=O)(=O)N2CCOCC2)cc1
: