Target
Phospholipase A and acyltransferase 3
Ligand
BDBM50544548
Substrate
Meas. Tech.
ChEMBL_1993178 (CHEMBL4626913)
IC50
<10000±n/a nM
Citation
 Zhou, JMock, EDAl Ayed, KDi, XKantae, VBurggraaff, LStevens, AFMartella, AMohr, FJiang, Mvan der Wel, TWendel, TJOfman, TPTran, Yde Koster, Nvan Westen, GJPHankemeier, Tvan der Stelt, M Structure-Activity Relationship Studies of ?-Ketoamides as Inhibitors of the Phospholipase A and Acyltransferase Enzyme Family. J Med Chem 63:9340-9359 (2020)  
Target
Name:
Phospholipase A and acyltransferase 3
Synonyms:
2.3.1.- 3.1.1.4 Adipose-specific phospholipase A2 H-REV107 HRAS-like suppressor 1 HRASLS3 HREV107-1 HRSL3 PLAAT3 Phospholipase A and acyltransferase 3 Synonyms=HRASLS3
Type:
PROTEIN
Mol. Mass.:
17939.48
Organism:
Homo sapiens
Description:
ChEMBL_116859
Residue:
162
  
Inhibitor
Name:
BDBM50544548
Synonyms:
CHEMBL4634887
Type:
Small organic molecule
Emp. Form.:
C18H19NO2
Mol. Mass.:
281.349
SMILES:
O=C(CCc1ccccc1)CC(=O)NCc1ccccc1
: