Target
Transient receptor potential cation channel subfamily V member 4
Ligand
BDBM50240777
Substrate
Meas. Tech.
ChEMBL_1994275 (CHEMBL4628170)
EC50
370±n/a nM
Citation
 Lawhorn, BGBrnardic, EJBehm, DJ Recent advances in TRPV4 agonists and antagonists. Bioorg Med Chem Lett 30:0 (2020)  
Target
Name:
Transient receptor potential cation channel subfamily V member 4
Synonyms:
TRPV4_MOUSE Trpv4 Vroac
Type:
PROTEIN
Mol. Mass.:
98032.61
Organism:
Mus musculus
Description:
ChEMBL_1514430
Residue:
871
  
Inhibitor
Name:
BDBM50240777
Synonyms:
4alpha-phorbol-didecanoate Decanoic acid (1aR,1bS,4aS,7aS,7bS,8R,9R,9aS)-9-decanoyloxy-4a,7b-dihydroxy-3-hydroxymethyl-1,1,6,8-tetramethyl-5-oxo-1,1a,1b,4,4a,5,7a,7b,8,9-decahydro-cyclopropa[3,4]benzo[1,2-e]azulen-9a-yl ester
Type:
Small organic molecule
Emp. Form.:
C40H64O8
Mol. Mass.:
672.9314
SMILES:
CCCCCCCCCC(=O)O[C@@H]1[C@@H](C)[C@]2(O)[C@@H]3C=C(C)C(=O)[C@]3(O)CC(CO)=C[C@H]2[C@@H]2C(C)(C)[C@]12OC(=O)CCCCCCCCC
: